BDBM133968 US8846929, 367
SMILES CCOC(=O)c1nc2ccccc2n([C@@H]2C[C@@H]3CCC[C@H](C2)N3C2CCC(C)(C)CC2)c1=O
InChI Key InChIKey=QXDBMXZCFGSMQZ-AERCQKQUSA-N
Data  1 KI
  Tab Delimited (TSV)   2D SDfile   Computed 3D by Vconf -m prep SDfile
Find this compound or compounds like it in BindingDB:
Activity Spreadsheet -- Enzyme Inhibition Constant Data from BindingDB
Found 1 hit for monomerid = 133968
TargetOpioid growth factor receptor-like protein 1(Homo sapiens (Human))
Purdue Pharma
US Patent
LigandPNGBDBM133968(US8846929, 367)
Affinity DataKi:  374nMpH: 7.4Assay Description:Radioligand binding assays (screening and dose-displacement) used 0.1nM [3H]-nociceptin (NEN; 87.7 Cl/nimole) with 10-20 ug membrane protein in a fin...
In DepthDetails US Patent